{"text_format":"1","workbook":"xlsx","n_sheets":6,"sheets":["Instructions","Entry Sheet","Bill Print","Calculation sheet","Annual Report","Sheet5"],"not_rendered":{"charts":0,"images":0,"macros":1,"external_links":1,"defined_names":3,"comments":1,"pivot_tables":0},"unopened":[],"bounds":{"document_bytes":16777216,"sheet_cells":100000,"rows_first":2000,"rows_last":500,"rows_between":2000,"halvings":0,"cell_chars":16384,"cell_head_chars":4096},"cells_cut":0,"cells_raw":0,"read":"whole","date_system":"1900"}

{"sheet":"Instructions","index":0,"n_rows":10,"n_cols":1,"rows_kept":10,"cut":false,"hidden":false,"merged":[]}
["Instructions"]
["Kindly read All Instructions before Use Report Card Utitly"]
["1. To Fill All Required Data Use  Entry Sheet "]
["2. Fill Data only In Yellow Cell."]
["3. Select Month , Year And Day on Which Kheer is prepared for students"]
["4. in Entry Sheet Enter Date wise No. of Students to whom Served Meal (Yellow Cells). Left Cell Blank On Holidays "]
["5. Now Goto Bill Print Sheet To Print Bill. There are two option First Auto Bill - No Need To do any think just take print or Make pdfSecond is Custom Bill - Where you can Fill Custom rate of items. I Custom Bill you have to Match Bill Amount with Montly cost "]
["6. Calculation Sheet is Just to Show Daily And Mothly Consumtion of Various Items Used in MDM"]
["7. If any Query/Suggestion Please Email Us at abhi072011@gmail.com"]
["8. Visit Website for More Tools "]

{"sheet":"Entry Sheet","index":1,"n_rows":53,"n_cols":23,"rows_kept":53,"cut":false,"hidden":false,"merged":[[14,17,15,17],[32,0,33,0],[32,1,33,1],[34,0,35,0],[34,1,35,1],[8,3,8,15],[36,0,37,0],[36,1,37,1],[38,0,39,0],[38,1,39,1],[4,13,4,14],[4,16,4,17],[6,9,6,10],[6,13,6,14],[6,16,6,17],[0,0,0,8],[2,1,2,7],[12,0,12,1],[0,9,0,15],[0,16,0,17],[2,9,2,10],[2,13,2,15],[2,16,2,18],[9,3,9,13],[11,4,11,9],[11,13,11,14],[4,1,4,7],[6,1,6,7],[7,9,7,10],[8,16,8,17],[4,9,4,10]]}
["ਮਿਡ-ਡੇ-ਮੀਲ kYlkulytr (pRwiemrI)",null,null,null,null,null,null,null,null,"ਇਸ ਐਂਟਰੀ ਸ਼ੀਟ ਦੇ ਪੀਲੇ ਖਾਨਿਆਂ ਵਿੱਚ twiep kਰੋ ਅਤੇ ib`l ਦੇ ਪ੍ਰਿੰਟ ਪ੍ਰਾਪਤ ਕਰੋ",null,null,null,null,null,null,"Cooking Cost Per Student",null,6.78]
[]
["ਸਕੂਲ    :","srkwrI pRwiemrI skUl ",null,null,null,null,null,null,null,"ਮਹੀਨਾ:",null,"May",null,"Anwj dw ਮੁਢਲਾ ਬਕਾਇਆ",null,null,"ies mhIny pRwpq Anwj"]
[]
["blwk   :","KMnw-2",null,null,null,null,null,null,null,"ਸਾਲ:",null,2025,null,"kxk (ਕਿਲੋਗ੍ਰਾਮ):",null,0,"kxk (ਕਿਲੋਗ੍ਰਾਮ):",null,0]
[]
["ਜਿਲ੍ਹਾ    :","luiDAwxw",null,null,null,null,null,null,null,"ਖੀਰ ਬਣਾਉਣ ਵਾਲਾ ਦਿਨ :",null,"Mon",null,"cwvl  (ਕਿਲੋਗ੍ਰਾਮ):",null,0,"cwvl (ਕਿਲੋਗ੍ਰਾਮ):",null,0]
[null,null,null,null,null,null,null,null,null,"PrUt dyx dw idn :",null,"Wed"]
[null,null,null,"imf-fy-mIl sbMDI Anwj dw stwk Aqy Kpq rijstr ( jmwq 1vIN qo 5vIN)",null,null,null,null,null,null,null,null,null,null,null,null,"Total Working Day",null,{"$f":"COUNTIF(J15:J45,\">0\")","v":2}]
[null,null,null,{"$f":"B3&\"   \"&\" blwk \"&\"  \"&B5&\" \"&\"  ijlHw  \"& \"  \"&B7 & \" \"","v":"srkwrI pRwiemrI skUl     blwk   KMnw-2   ijlHw    luiDAwxw "},null,null,null,null,null,null,null,null,null,null,{"$f":"L3","v":"May"},{"$f":"L5","v":2025},null,null,null,null,null,"Satrt Date",{"$f":"DATEVALUE(1&L3&L5)","v":"2025-05-01"}]
[]
[null,null,null,"imqI","Bojn Kwx vwly ividAwrQI",null,null,null,null,null,"kxk","cwvl","shI"," mYbrW vlO nrIKx",null,"irmwks",null,null,null,null,null,"End Date",{"$f":"EOMONTH(W10,0)","v":"2025-05-31"}]
["mhIny dorwn AOsqn dwKl ividAwrQI \ndI igxqI:-",null,null,null,1,2,3,4,5,"ku`l","K`pq 100 gRwm pRiq ivid","K`pq 100 gRwm pRiq ivid.",null,"nW","hsqwKr"]
[null,null,null,null,"hwjr","hwjr","hwjr","hwjr","hwjr","hwjr","iklo ivc","iklo iv`c",null,null,null,null,null,null,null,null,null,null,"Jan"]
["mhIny dy surU ivc muFlw bkweiAw",null,null,{"$f":"W10","v":"2025-05-01"},null,null,null,null,null,{"$f":"SUM(E15:I15)","v":0},{"$f":"'Calculation sheet'!L7","v":0},{"$f":"'Calculation sheet'!M7","v":0},null,null,null,null,null,null,null,null,{"$f":"IF(ISBLANK((D15)),\"None\",TEXT(D15,\"DDD\"))","v":"Thu"},"Mon","Feb"]
["kxk (iklo iv`c)","cwvl (iklo iv`c)",null,{"$f":"IF(D15<$W$12,D15+1,\"\")","v":"2025-05-02"},null,null,null,null,null,{"$f":"SUM(E16:I16)","v":0},{"$f":"'Calculation sheet'!L8","v":0},{"$f":"'Calculation sheet'!M8","v":0},null,null,null,null,null,null,null,null,{"$f":"IF(ISBLANK((D16)),\"None\",TEXT(D16,\"DDD\"))","v":"Fri"},"Tue","Mar"]
[{"$f":"P5","v":0},{"$f":"P7","v":0},null,{"$f":"IF(D16<$W$12,D16+1,\"\")","v":"2025-05-03"},null,null,null,null,null,0,{"$f":"'Calculation sheet'!L9","v":0},{"$f":"'Calculation sheet'!M9","v":0},null,null,null,null,null,null,null,null,"Sat","Wed","Apr"]
[null,null,null,"2025-05-04",null,null,null,null,null,0,{"$f":"'Calculation sheet'!L10","v":0},{"$f":"'Calculation sheet'!M10","v":0},null,null,null,null,null,null,null,null,"Sun","Thu","May"]
[" pRwpq      kxk","cwvl",null,"2025-05-05",null,null,null,null,null,0,{"$f":"'Calculation sheet'!L11","v":0},{"$f":"'Calculation sheet'!M11","v":0},null,null,null,null,null,null,null,null,"Mon","Fri","Jun"]
[{"$f":"S5","v":0},{"$f":"S7","v":0},null,"2025-05-06",null,null,null,null,null,0,{"$f":"'Calculation sheet'!L12","v":0},{"$f":"'Calculation sheet'!M12","v":0},null,null,null,null,null,null,null,null,"Tue","Sat","Jul"]
{"$rows_left_out":34}
{"sheet":"Bill Print","index":2,"n_rows":44,"n_cols":19,"rows_kept":44,"cut":false,"hidden":false,"merged":[[1,2,1,7],[19,2,19,7],[24,5,25,5],[24,6,25,6],[24,7,25,7],[11,6,14,6],[11,7,14,7],[18,3,18,5],[24,16,25,16],[24,17,25,17],[30,2,30,7],[2,2,2,5],[3,2,3,7],[26,2,26,7],[24,18,25,18],[26,13,26,18],[30,13,30,18],[35,12,35,19],[0,1,0,8],[1,1,34,1],[1,8,34,8],[35,1,35,8],[0,12,0,19],[1,12,34,12],[1,13,1,18],[1,19,34,19],[2,13,2,16],[3,13,3,18],[18,14,18,16],[19,13,19,18]]}
[]
[null,null,"Monthly Bill Item Wise Auto",null,null,null,null,null,null,null,null,null,null,"Monthly Bill Custom Rate Wise"]
[null,null,"For the Month of: ",null,null,null,null,{"$f":"'Entry Sheet'!L3&\"_\"&'Entry Sheet'!L5","v":"May_2025"},null,null,null,null,null,"For the Month of: ",null,null,null,{"$f":"H3","v":"May_2025"},{"$f":"#REF!&+\"_\"&#REF!","v":{"$error":"#REF!"}}]
[null,null,"kirAwnw ib`l",null,null,null,null,null,null,null,null,null,null,"kirAwnw ib`l"]
[null,null,"Sr. no.","Item","Quantity","Rate","Total","Total Amount",null,null,null,null,null,"Sr. no.","Item","Quantity","Rate","Total","Total Amount"]
[null,null,1,"dwl (cnw Aqy muMgI)",{"$f":"'Calculation sheet'!$Z$38","v":0},110,{"$f":"E6*F6","v":0},{"$f":"G6","v":0},null,null,null,null,null,1,"dwl (cnw Aqy muMgI)",{"$f":"'Calculation sheet'!$Z$38","v":0},100,{"$f":"P6*Q6","v":0},{"$f":"R6","v":0}]
[null,null,2,"kwly Coly",{"$f":"'Calculation sheet'!$AA$38","v":10},90,{"$f":"E7*F7","v":900},{"$f":"G7","v":900},null,null,null,null,null,2,"kwly Coly",{"$f":"'Calculation sheet'!$AA$38","v":10},90,{"$f":"P7*Q7","v":900},{"$f":"R7","v":900}]
[null,null,3,"bysx",{"$f":"'Calculation sheet'!$AD$38","v":6},105,630,630,null,null,null,null,null,3,"bysx",{"$f":"'Calculation sheet'!$AD$38","v":6},105,630,630]
[null,null,4,"irPwief qyl",{"$f":"'Calculation sheet'!$AG$38","v":5.7},130,741,741,null,null,null,null,null,4,"irPwief qyl",{"$f":"'Calculation sheet'!$AG$38","v":5.7},130,741,741]
[null,null,5,"cInI",{"$f":"'Calculation sheet'!$AH$38","v":0},40,0,0,null,null,null,null,null,5,"cInI",{"$f":"'Calculation sheet'!$AH$38","v":0},40,0,0]
[null,null,6,"rwjmwh",{"$f":"'Calculation sheet'!$AK$38","v":0},95,0,0,null,null,null,null,null,6,"rwjmwh",{"$f":"'Calculation sheet'!$AK$38","v":0},95,0,0]
[null,null,7,"nmk",null,null,{"$f":"ROUND(SUM(G6:G11)/8,0)","v":284},{"$f":"G12","v":284},null,null,null,null,null,7,"nmk",null,50,{"$f":"Q12","v":50},{"$f":"R12","v":50}]
[null,null,8,"hldI",null,null,null,null,null,null,null,null,null,8,"hldI",null,50,{"$f":"Q13","v":50},{"$f":"R13","v":50}]
[null,null,9,"imrc",null,null,null,null,null,null,null,null,null,9,"imrc",null,10,10,10]
[null,null,10,"mswlw",null,null,null,null,null,null,null,null,null,10,"mswlw",null,50,50,{"$f":"R15","v":50}]
[null,null,11,"dwKW",{"$f":"IF(H29<1,0,IF(H29<700,1,IF(H29<1000,2,IF(H29<1600,3,IF(H29<2500,4,IF(H29>3000,5,0))))))","v":0},50,0,{"$f":"G16","v":0},null,null,null,null,null,11,"dwKW",null,null,{"$f":"Q16","v":0},{"$f":"R16","v":0}]
[null,null,12,"Kopw",{"$f":"IF(H29<1,0,IF(H29<700,1,IF(H29<1000,2,IF(H29<1600,3,IF(H29<2500,4,IF(H29>3000,5,0))))))","v":0},20,0,{"$f":"G17","v":0},null,null,null,null,null,12,"Kopw",null,null,{"$f":"Q17","v":0},{"$f":"R17","v":0}]
[null,null,13,"jIrw (grwmW iv`c)",{"$f":"IF(F44<4000,100,IF(F44<10000,200,IF(F44<15000,300,IF(F44<20000,350,IF(F44>20000,400,0)))))","v":200},490,{"$f":"(E18*F18)/1000","v":98},{"$f":"G18+G44","v":98},null,null,null,null,null,13,"jIrw (grwmW iv`c)",null,null,0,{"$f":"R18+R44","v":0}]
[null,null,null,"Total",null,null,{"$f":"SUM(G6:G18)","v":2653},{"$f":"SUM(H6:H18)","v":2653},null,null,null,null,null,null,"Total",null,null,{"$f":"SUM(R6:R18)","v":2431},{"$f":"SUM(S6:S18)","v":2431}]
[null,null,"sbjI mMfI ib`l",null,null,null,null,null,null,null,null,null,null,"sbjI mMfI ib`l"]
{"$rows_left_out":25}
{"sheet":"Calculation sheet","index":3,"n_rows":40,"n_cols":41,"rows_kept":40,"cut":false,"hidden":false,"merged":[[2,25,2,36],[38,7,38,10],[4,38,4,40],[5,0,5,1],[2,15,3,16],[2,17,4,17],[2,18,4,18],[3,5,3,6],[3,7,3,8],[2,11,3,12],[2,13,3,14],[1,0,1,19],[2,0,4,0],[2,1,4,1],[2,2,4,2],[2,3,4,3],[2,4,4,4],[2,5,2,8],[2,9,3,10],[2,19,4,19]]}
[]
[{"$f":"\"rojwnw Anwj dI Kpq Aqy pkwaux dy Krcy dI irport\"&\n\"   skUl dw nwm: = \"&'Entry Sheet'!D10","v":"rojwnw Anwj dI Kpq Aqy pkwaux dy Krcy dI irport   skUl dw nwm: = srkwrI pRwiemrI skUl     blwk   KMnw-2   ijlHw    luiDAwxw "}]
["lVI nM","imqI","dwKl hoey ividAwrQIAw dI igxqI","hwjLr ividAwrQIAw dI igxqI","Bojn krn vwly ividAwrQIAw dI igxqI","skUl ivwc Anwj dw BMzwr",null,null,null,"ku`l BMfwr",null,"A`j dy idn dI Anwj dI vrqoN",null,"ies mhIny dI Anwj dI vrqoN pROgRYisv",null,"Anwj dw bkwieAw BMzwr",null,"A`j dy idn dw Bojn bxwaux dw Krcw","ies mhIny dw pOgRYisv Bojn pkwaux dw Krcw","Bojn dI iksm",null,null,null,null,null,"Bojn bnwaux leI dUsrI smgrI (iklo iv`c)"]
[null,null,null,null,null,"muuFlw bkwieAw",null,"A`j dy idn dI pRwpqI"]
[null,null,null,null,null,"kxk \niklo ivwc","cwvl iklo iv`c","kxk \nik`lo iv`c","cwvl iklo iv`c","kxk \nik`lo iv`c","cwvl iklo iv`c","kxk \nik`lo iv`c","cwvl iklo iv`c","kxk \nik`lo ivwc","cwvl iklo iv`c","kxk \nik`lo ivwc","cwvl iklo iv`c",null,null,null,null,{"$f":"'Entry Sheet'!L7","v":"Mon"},null,null,null,"Dal","Black Channa","Onion ","Curd","Besan","Vegetables","Vegitable for Dal","Oil & Fat","Sugar","Milk","Pattato","Rajmah","Fruits","pRqI b`cw rwSn dI imkdwr"]
["Previous\n",null,null,null,0,{"$f":"'Entry Sheet'!P5","v":0},{"$f":"'Entry Sheet'!P7","v":0},{"$f":"'Entry Sheet'!S5","v":0},{"$f":"'Entry Sheet'!S7","v":0},null,null,null,null,null,null,null,null,null,null,null,null,null,null,null,null,"In KG","In KG","In KG","In KG","In KG","In KG","In KG","In KG","In KG","In Litt","In KG","In kg","pcs","Item","Quantity /Std in gm","In KG"]
[1,{"$f":"'Entry Sheet'!D15","v":"2025-05-01"},null,{"$f":"'Entry Sheet'!J15","v":0},{"$f":"D7","v":0},{"$f":"F6","v":0},{"$f":"G6","v":0},0,0,{"$f":"F7+H6","v":0},{"$f":"G7+I6","v":0},{"$f":"IF(OR(X7=\"MonOK\",X7=\"WedOK\",X7=\"FriOK\"),E7*0.1,IF(OR(X7=\"MonOK Aqy Kir\",X7=\"WedOK Aqy Kir\",X7=\"FriOK Aqy Kir\"),E7*0.09,0))","v":0},{"$f":"IF(OR(X7=\"TueOK\",X7=\"ThuOK\",X7=\"SatOK\"),E7*0.1,IF(OR(X7=\"MonOK Aqy Kir\",X7=\"WedOK Aqy Kir\",X7=\"FriOK Aqy Kir\"),E7*0.01,IF(OR(X7=\"TueOK Aqy Kir\",X7=\"ThuOK Aqy Kir\",X7=\"SatOK Aqy Kir\"),E7*0.1,0)))","v":0},{"$f":"N6+L7","v":0},0,{"$f":"J7-L7","v":0},{"$f":"K7-M7","v":0},{"$f":"E7*'Entry Sheet'!$S$1","v":0},{"$f":"S6+R7","v":0},{"$f":"CHOOSE(Y7,\"dwl (mOsmI sbjI imlw ky) Aqy rotI\",\"rwjmwh Aqy  cwvl\",\"kwly Colyy(AwlU imlw ky)Aqy rotI \",\"kVI (pkOoiVAW smyq) Aqy cwvl\",\"moOsmI sbjI Aqy rotI\",\"dwl (mOsmI sbjI imlw ky) Aqy cwvl \",\"dwl (mOsmI sbjI imlw ky) Aqy rotI Aqy KIr\",\"rwjmwh Aqy  cwvl Aqy KIr\",\"kwly Colyy(AwlU imlw ky)Aqy rotI Aqy KIr\",\"kVI (pkOoiVAW smyq) Aqy cwvl Aqy KIr\",\"moOsmI sbjI Aqy rotI Aqy KIr\",\"dwl (mOsmI sbjI imlw ky) Aqy cwvl Aqy KIr\",\"Cu`tI\",\"Cu`tI\")","v":"Cu`tI"},{"$f":"IF(AND(W7=\"Wed\",E7>0),\"kwly Colyy(AwlU imlw ky)Aqy rotI \",IF(AND(W7=\"Thu\",E7>0),\"kVI (pkOoiVAW smyq) Aqy cwvl\",IF(AND(W7=\"Mon\",E7>0),\"dwl (mOsmI sbjI imlw ky) Aqy rotI\",IF(AND(W7=\"Tue\",E7>0),\"rwjmwh Aqy  cwvl\",IF(AND(W7=\"Fri\",E7>0),\"moOsmI sbjI Aqy rotI\",IF(AND(W7=\"Sat\",E7>0),\"dwl (mOsmI sbjI imlw ky) Aqy cwvl \",\"Cu`tI\"))))))","v":"Cu`tI"},{"$f":"IF(AND(E7>0,$V$5=W7),\" Aqy KIr\",\"\")","v":""},{"$f":"'Entry Sheet'!U15","v":"Thu"},{"$f":"IF(E7>0,W7&\"OK\"&V7,\"\")","v":""},{"$f":"IF(X7=\"MonOk\",1,IF(X7=\"TueOk\",2,IF(X7=\"WedOk\",3,IF(X7=\"ThuOk\",4,IF(X7=\"FriOk\",5,IF(X7=\"SatOk\",6,IF(X7=\"MonOk Aqy KIr\",7,IF(X7=\"TueOk Aqy KIr\",8,IF(X7=\"WedOk Aqy KIr\",9,IF(X7=\"ThuOk Aqy KIr\",10,IF(X7=\"FriOk Aqy KIr\",11,IF(X7=\"SatOk Aqy KIr\",12,IF(W7=\"Sun\",13,14)))))))))))))","v":14},{"$f":"IF(OR(Y7=1,Y7=6,Y7=7,Y7=12),E7*$AO$7,0)","v":0},{"$f":"IF(OR(Y7=3,Y7=9),E7*$AO$8,0)","v":0},{"$f":"IF(OR(Y7=1,Y7=6,Y7=7,Y7=12,Y7=2,Y7=8),E7*$AO$21,IF(OR(Y7=3,Y7=9),E7*$AO$22,IF(OR(Y7=4,Y7=10),E7*$AO$23,IF(OR(Y7=5,Y7=11),E7*$AO$24,0))))","v":0},{"$f":"IF(OR(Y7=4,Y7=10),E7*$AO$19,0)","v":0},{"$f":"IF(OR(Y7=4,Y7=10),E7*$AO$10,0)","v":0},{"$f":"IF(OR(Y7=5,Y7=11),E7*$AO$28,0)","v":0},{"$f":"IF(OR(Y7=1,Y7=6,Y7=7,Y7=12),E7*$AO$27,0)","v":0},{"$f":"IF(OR(Y7=1,Y7=6,Y7=7,Y7=12,Y7=2,Y7=8),E7*$AO$11,IF(OR(Y7=3,Y7=9),E7*$AO$12,IF(OR(Y7=4,Y7=10),E7*$AO$13,IF(OR(Y7=5,Y7=11),E7*$AO$14,0))))","v":0},{"$f":"IF(OR(Y7=7,Y7=8,Y7=9,Y7=10,Y7=11,Y7=12),E7*$AO$18,0)","v":0},{"$f":"IF(OR(Y7=7,Y7=8,Y7=9,Y7=10,Y7=11,Y7=12),E7*$AO$20,0)","v":0},{"$f":"IF(OR(Y7=4,Y7=10),E7*$AO$25,IF(OR(Y7=3,Y7=9),E7*$AO$26,0))","v":0},{"$f":"IF(OR(Y7=2,Y7=8),E7*$AO$9,0)","v":0},{"$f":"IF('Entry Sheet'!$L$8='Calculation sheet'!W7,E7,0)","v":0},"dwl",20,{"$f":"AN7/1000","v":0.02}]
[2,{"$f":"'Entry Sheet'!D16","v":"2025-05-02"},null,{"$f":"'Entry Sheet'!J16","v":0},{"$f":"D8","v":0},{"$f":"P7","v":0},{"$f":"Q7","v":0},0,0,{"$f":"F8+H8","v":0},{"$f":"G8+I8","v":0},{"$f":"IF(OR(X8=\"MonOK\",X8=\"WedOK\",X8=\"FriOK\"),E8*0.1,IF(OR(X8=\"MonOK Aqy Kir\",X8=\"WedOK Aqy Kir\",X8=\"FriOK Aqy Kir\"),E8*0.09,0))","v":0},{"$f":"IF(OR(X8=\"TueOK\",X8=\"ThuOK\",X8=\"SatOK\"),E8*0.1,IF(OR(X8=\"MonOK Aqy Kir\",X8=\"WedOK Aqy Kir\",X8=\"FriOK Aqy Kir\"),E8*0.01,IF(OR(X8=\"TueOK Aqy Kir\",X8=\"ThuOK Aqy Kir\",X8=\"SatOK Aqy Kir\"),E8*0.1,0)))","v":0},0,0,{"$f":"J8-L8","v":0},{"$f":"K8-M8","v":0},{"$f":"E8*'Entry Sheet'!$S$1","v":0},{"$f":"S7+R8","v":0},{"$f":"CHOOSE(Y8,\"dwl (mOsmI sbjI imlw ky) Aqy rotI\",\"rwjmwh Aqy  cwvl\",\"kwly Colyy(AwlU imlw ky)Aqy rotI \",\"kVI (pkOoiVAW smyq) Aqy cwvl\",\"moOsmI sbjI Aqy rotI\",\"dwl (mOsmI sbjI imlw ky) Aqy cwvl \",\"dwl (mOsmI sbjI imlw ky) Aqy rotI Aqy KIr\",\"rwjmwh Aqy  cwvl Aqy KIr\",\"kwly Colyy(AwlU imlw ky)Aqy rotI Aqy KIr\",\"kVI (pkOoiVAW smyq) Aqy cwvl Aqy KIr\",\"moOsmI sbjI Aqy rotI Aqy KIr\",\"dwl (mOsmI sbjI imlw ky) Aqy cwvl Aqy KIr\",\"Cu`tI\",\"Cu`tI\")","v":"Cu`tI"},{"$f":"IF(AND(W8=\"Wed\",E8>0),\"kwly Colyy(AwlU imlw ky)Aqy rotI \",IF(AND(W8=\"Thu\",E8>0),\"kVI (pkOoiVAW smyq) Aqy cwvl\",IF(AND(W8=\"Mon\",E8>0),\"dwl (mOsmI sbjI imlw ky) Aqy rotI\",IF(AND(W8=\"Tue\",E8>0),\"rwjmwh Aqy  cwvl\",IF(AND(W8=\"Fri\",E8>0),\"moOsmI sbjI Aqy rotI\",IF(AND(W8=\"Sat\",E8>0),\"dwl (mOsmI sbjI imlw ky) Aqy cwvl \",\"Cu`tI\"))))))","v":"Cu`tI"},{"$f":"IF(AND(E8>0,$V$5=W8),\" Aqy KIr\",\"\")","v":""},{"$f":"'Entry Sheet'!U16","v":"Fri"},{"$f":"IF(E8>0,W8&\"OK\"&V8,\"\")","v":""},{"$f":"IF(X8=\"MonOk\",1,IF(X8=\"TueOk\",2,IF(X8=\"WedOk\",3,IF(X8=\"ThuOk\",4,IF(X8=\"FriOk\",5,IF(X8=\"SatOk\",6,IF(X8=\"MonOk Aqy KIr\",7,IF(X8=\"TueOk Aqy KIr\",8,IF(X8=\"WedOk Aqy KIr\",9,IF(X8=\"ThuOk Aqy KIr\",10,IF(X8=\"FriOk Aqy KIr\",11,IF(X8=\"SatOk Aqy KIr\",12,IF(W8=\"Sun\",13,14)))))))))))))","v":14},0,0,0,0,0,0,0,0,0,0,0,0,{"$f":"IF('Entry Sheet'!$L$8='Calculation sheet'!W8,E8,0)","v":0},"Coly",25,{"$f":"AN8/1000","v":2.5000000000000001E-2}]
[3,{"$f":"'Entry Sheet'!D17","v":"2025-05-03"},null,{"$f":"'Entry Sheet'!J17","v":0},0,{"$f":"P8","v":0},{"$f":"Q8","v":0},0,0,{"$f":"F9+H9","v":0},{"$f":"G9+I9","v":0},0,0,0,0,{"$f":"J9-L9","v":0},{"$f":"K9-M9","v":0},{"$f":"E9*'Entry Sheet'!$S$1","v":0},{"$f":"S8+R9","v":0},"Cu`tI","Cu`tI","",{"$f":"'Entry Sheet'!U17","v":"Sat"},"",14,0,0,0,0,0,0,0,0,0,0,0,0,{"$f":"IF('Entry Sheet'!$L$8='Calculation sheet'!W9,E9,0)","v":0},"rwj mwh",20,0.02]
[4,{"$f":"'Entry Sheet'!D18","v":"2025-05-04"},null,{"$f":"'Entry Sheet'!J18","v":0},0,0,0,0,0,0,0,0,0,{"$f":"N9+L10","v":0},{"$f":"O9+M10","v":0},0,0,{"$f":"E10*'Entry Sheet'!$S$1","v":0},0,"Cu`tI","Cu`tI","",{"$f":"'Entry Sheet'!U18","v":"Sun"},"",13,0,0,0,0,0,0,0,0,0,0,0,0,{"$f":"IF('Entry Sheet'!$L$8='Calculation sheet'!W10,E10,0)","v":0},"bysx",20,0.02]
[5,{"$f":"'Entry Sheet'!D19","v":"2025-05-05"},null,{"$f":"'Entry Sheet'!J19","v":0},0,0,0,0,0,0,0,0,0,{"$f":"N10+L11","v":0},0,{"$f":"J11-L11","v":0},0,{"$f":"E11*'Entry Sheet'!$S$1","v":0},0,"Cu`tI","Cu`tI",{"$f":"IF(AND(E11>0,$V$5=W11),\" Aqy KIr\",\"\")","v":""},{"$f":"'Entry Sheet'!U19","v":"Mon"},"",14,0,0,0,0,0,0,0,0,0,0,0,0,{"$f":"IF('Entry Sheet'!$L$8='Calculation sheet'!W11,E11,0)","v":0},"irPwief dwl/rwjmwh",5,5.0000000000000001E-3]
[6,{"$f":"'Entry Sheet'!D20","v":"2025-05-06"},null,{"$f":"'Entry Sheet'!J20","v":0},0,0,0,0,0,0,0,0,0,0,0,0,0,{"$f":"E12*'Entry Sheet'!$S$1","v":0},0,"Cu`tI","Cu`tI","",{"$f":"'Entry Sheet'!U20","v":"Tue"},"",14,0,0,0,0,0,0,0,0,0,0,0,0,{"$f":"IF('Entry Sheet'!$L$8='Calculation sheet'!W12,E12,0)","v":0},"irPwief CoilAw nwl",10.5,1.0500000000000001E-2]
[7,{"$f":"'Entry Sheet'!D21","v":"2025-05-07"},null,{"$f":"'Entry Sheet'!J21","v":400},400,0,0,0,0,0,0,40,0,40,0,-40,0,{"$f":"E13*'Entry Sheet'!$S$1","v":2712},2712,"kwly Colyy(AwlU imlw ky)Aqy rotI ","kwly Colyy(AwlU imlw ky)Aqy rotI ","",{"$f":"'Entry Sheet'!U21","v":"Wed"},"WedOK",3,0,10,6,0,0,0,0,4.2,0,0,6,0,{"$f":"IF('Entry Sheet'!$L$8='Calculation sheet'!W13,E13,0)","v":400},"irPwief kVI nwl",5,5.0000000000000001E-3]
[8,{"$f":"'Entry Sheet'!D22","v":"2025-05-08"},null,{"$f":"'Entry Sheet'!J22","v":300},300,-40,0,0,0,-40,0,0,30,40,30,-40,-30,{"$f":"E14*'Entry Sheet'!$S$1","v":2034},4746,"kVI (pkOoiVAW smyq) Aqy cwvl","kVI (pkOoiVAW smyq) Aqy cwvl","",{"$f":"'Entry Sheet'!U22","v":"Thu"},"ThuOK",4,0,0,3,6,6,0,0,1.5,0,0,3,0,{"$f":"IF('Entry Sheet'!$L$8='Calculation sheet'!W14,E14,0)","v":0},"irPwief mosmI sbjI",5,5.0000000000000001E-3]
[9,{"$f":"'Entry Sheet'!D23","v":"2025-05-09"},null,{"$f":"'Entry Sheet'!J23","v":0},0,-40,-30,0,0,-40,-30,0,0,40,30,-40,-30,{"$f":"E15*'Entry Sheet'!$S$1","v":0},4746,"Cu`tI","Cu`tI","",{"$f":"'Entry Sheet'!U23","v":"Fri"},"",14,0,0,0,0,0,0,0,0,0,0,0,0,{"$f":"IF('Entry Sheet'!$L$8='Calculation sheet'!W15,E15,0)","v":0},"nmk",null,0]
[10,{"$f":"'Entry Sheet'!D24","v":"2025-05-10"},null,{"$f":"'Entry Sheet'!J24","v":0},0,-40,-30,0,0,-40,-30,0,0,40,30,-40,-30,{"$f":"E16*'Entry Sheet'!$S$1","v":0},4746,"Cu`tI","Cu`tI","",{"$f":"'Entry Sheet'!U24","v":"Sat"},"",14,0,0,0,0,0,0,0,0,0,0,0,0,{"$f":"IF('Entry Sheet'!$L$8='Calculation sheet'!W16,E16,0)","v":0},"imrc/mswlw",null,0]
[11,{"$f":"'Entry Sheet'!D25","v":"2025-05-11"},null,{"$f":"'Entry Sheet'!J25","v":0},0,-40,-30,0,0,-40,-30,0,0,40,30,-40,-30,{"$f":"E17*'Entry Sheet'!$S$1","v":0},4746,"Cu`tI","Cu`tI","",{"$f":"'Entry Sheet'!U25","v":"Sun"},"",13,0,0,0,0,0,0,0,0,0,0,0,0,{"$f":"IF('Entry Sheet'!$L$8='Calculation sheet'!W17,E17,0)","v":0},"hldI",null,0]
[12,{"$f":"'Entry Sheet'!D26","v":"2025-05-12"},null,{"$f":"'Entry Sheet'!J26","v":0},0,-40,-30,0,0,-40,-30,0,0,40,30,-40,-30,{"$f":"E18*'Entry Sheet'!$S$1","v":0},4746,"Cu`tI","Cu`tI","",{"$f":"'Entry Sheet'!U26","v":"Mon"},"",14,0,0,0,0,0,0,0,0,0,0,0,0,{"$f":"IF('Entry Sheet'!$L$8='Calculation sheet'!W18,E18,0)","v":0},"cInI",10,0.01]
[13,{"$f":"'Entry Sheet'!D27","v":"2025-05-13"},null,{"$f":"'Entry Sheet'!J27","v":0},0,-40,-30,0,0,-40,-30,0,0,40,30,-40,-30,{"$f":"E19*'Entry Sheet'!$S$1","v":0},4746,"Cu`tI","Cu`tI","",{"$f":"'Entry Sheet'!U27","v":"Tue"},"",14,0,0,0,0,0,0,0,0,0,0,0,0,{"$f":"IF('Entry Sheet'!$L$8='Calculation sheet'!W19,E19,0)","v":0},"dhI",20,0.02]
[14,{"$f":"'Entry Sheet'!D28","v":"2025-05-14"},null,{"$f":"'Entry Sheet'!J28","v":0},0,-40,-30,0,0,-40,-30,0,0,40,30,-40,-30,{"$f":"E20*'Entry Sheet'!$S$1","v":0},4746,"Cu`tI","Cu`tI","",{"$f":"'Entry Sheet'!U28","v":"Wed"},"",14,0,0,0,0,0,0,0,0,0,0,0,0,{"$f":"IF('Entry Sheet'!$L$8='Calculation sheet'!W20,E20,0)","v":0},"du`D",30,0.03]
{"$rows_left_out":21}
{"sheet":"Annual Report","index":4,"n_rows":618,"n_cols":18,"rows_kept":618,"cut":false,"hidden":false,"merged":[[1,15,2,15],[1,16,2,16],[1,17,2,17],[1,11,2,11],[1,12,2,12],[1,13,2,13],[1,14,2,14],[0,0,0,14],[1,1,1,2],[1,3,1,4],[1,5,1,6],[1,7,1,8],[1,9,2,9],[1,10,2,10]]}
["Month Wise Record"]
[null,"Opening Balance",null,"Receiving This Month",null,"Consumption (in Kg)",null,"Balance at End",null,"Total Students","Cookng Cost of All Std.","Fund Allocate at PFMS This Month","Fund Utilize AS PFMS (in RS.)","Balance Fund in PFMS","Fund Surplus/Short As Total Cost ","Total Pieces Fruit  Given","Amount of Food","Woking Days"]
["Month &Year","Wheat","Rice","Wheat","Rice","Wheat","Rice","Wheet","Rice"]
["2024-10-01",0,0,0,0,0,0,{"$f":"(B4+D4)-F4","v":0},{"$f":"(C4+E4)-G4","v":0},0,0,0,0,{"$f":"L4-M4","v":0},{"$f":"L4-K4","v":0}]
["2025-01-01",0,0,0,0,130,160,{"$f":"(B5+D5)-F5","v":-130},{"$f":"(C5+E5)-G5","v":-160},2900,17951,null,null,{"$f":"L5-M5","v":0},{"$f":"L5-K5","v":-17951},700,3500,6]
[null,null,null,null,null,null,null,0,0,null,null,null,null,0,0]
[null,null,null,null,null,null,null,0,0,null,null,null,null,0,0]
[null,null,null,null,null,null,null,0,0,null,null,null,null,0,0]
[null,null,null,null,null,null,null,0,0,null,null,null,null,0,0]
[null,null,null,null,null,null,null,0,0,null,null,null,null,0,0]
[null,null,null,null,null,null,null,0,0,null,null,null,null,0,0]
[null,null,null,null,null,null,null,0,0,null,null,null,null,0,0]
[null,null,null,null,null,null,null,0,0,null,null,null,null,0,0]
[null,null,null,null,null,null,null,0,0,null,null,null,null,0,0]
[null,null,null,null,null,null,null,0,0,null,null,null,null,0,0]
[null,null,null,null,null,null,null,0,0,null,null,null,null,0,0]
[null,null,null,null,null,null,null,0,0,null,null,null,null,0,0]
[null,null,null,null,null,null,null,0,0,null,null,null,null,0,0]
[null,null,null,null,null,null,null,0,0,null,null,null,null,0,0]
[null,null,null,null,null,null,null,0,0,null,null,null,null,0,0]
{"$rows_left_out":599}
{"sheet":"Sheet5","index":5,"n_rows":37,"n_cols":9,"rows_kept":37,"cut":false,"hidden":true,"merged":[[0,0,0,5],[4,4,4,6],[31,5,33,6],[4,0,4,3],[2,2,2,5],[3,4,3,5],[1,3,1,6]]}
["kYS bu`k qy mwhvwrI (Abstract)gosvwrw"]
["(jmwq 1vI qo 5vI)",null,null,{"$f":"#REF!","v":{"$error":"#REF!"}}]
[]
[null,null,null,"mhInw",{"$f":"'Bill Print'!H3","v":"May_2025"}]
["kuikMg kwst dI pRpqI (ru ivc)",null,null,null,"Krcy dw vyrvw"]
["imqI","muFlw bkwieAw","pRwpqI","ku`l joV",1,"Bojn krn vwly ku`l ividAwrQIAW dI igxqI",{"$f":"#REF!","v":{"$error":"#REF!"}}]
[1,null,null,null,2,"skUl ivc vrikMg idnW dI igxqI",{"$f":"COUNTIF(#REF!,\">0\")","v":{"$error":"#REF!"}}]
[2,null,null,null,3,{"$f":"\"mwhvwrI rupey \" &#REF! &\"  pRqI b`cw pRqI idn nwl Krcw\"","v":{"$error":"#REF!"}},{"$f":"G6*#REF!","v":{"$error":"#REF!"}}]
[3,null,null,null,null,"ku`k Bytw(qnKwh)"]
[4,null,null,null,4,"kuikMg kwst dI ku`l rkm",null,null,"kuikMg kwst dw muFlw bkwieAW ilKo jI"]
[5,null,null,null,5,"mhIny dy AMq qy kuikMg kwst dI bkwieAW rkm",{"$f":"G10-G8","v":{"$error":"#REF!"}}]
[6,null,null,null,null,"(kwlm 4-3)"]
[7]
[8]
[9,null,null,null,null,"kuikMg kwst dI bkwieAw rkm",{"$f":"G10","v":0}]
[10,null,null,null,null,"Awmdn",null,null,"kuikMg kwst ies pRwpq rkm ilKo jI"]
[11,null,null,null,null,"ku`l Awmdn",{"$f":"G16+G15","v":0}]
[12,null,null,null,null,"ies mhIny dw Krc",{"$f":"G8","v":{"$error":"#REF!"}}]
[13,null,null,null,null,"bkwieAw kuikMg kwst dI rkm",{"$f":"G17-G18","v":{"$error":"#REF!"}}]
[14]
{"$rows_left_out":17}